{"text_format":"1","workbook":"xlsx","n_sheets":5,"sheets":["Arbeitsblatt","Quelle statisch","Addition G100","Division","Quelle dynamisch"],"not_rendered":{"charts":0,"images":4,"macros":1,"external_links":0,"defined_names":0,"comments":0,"pivot_tables":0},"unopened":[],"bounds":{"document_bytes":16777216,"sheet_cells":100000,"rows_first":2000,"rows_last":500,"rows_between":2000,"halvings":0,"cell_chars":16384,"cell_head_chars":4096},"cells_cut":0,"cells_raw":0,"read":"whole","date_system":"1900"}

{"sheet":"Arbeitsblatt","index":0,"n_rows":18,"n_cols":13,"rows_kept":18,"cut":false,"hidden":true,"merged":[[17,1,21,14]]}
[]
[null,6,"x",6,"=",36,null,null,5,"x",8,"=",40]
[null,5,"x",6,"=",30,null,null,5,"x",1,"=",5]
[null,8,"x",6,"=",48,null,null,8,"x",4,"=",32]
[null,1,"x",1,"=",1,null,null,2,"x",6,"=",12]
[null,8,"x",8,"=",64,null,null,6,"x",7,"=",42]
[null,4,"x",9,"=",36,null,null,6,"x",6,"=",36]
[null,10,"x",10,"=",100,null,null,4,"x",4,"=",16]
[null,2,"x",10,"=",20,null,null,2,"x",5,"=",10]
[null,1,"x",4,"=",4,null,null,4,"x",2,"=",8]
[null,6,"x",8,"=",null,null,null,6,"x",2,"=",12]
[null,7,"x",8,"=",null,null,null,7,"x",2,"=",14]
[null,1,"x",4,"=",null,null,null,5,"x",3,"=",15]
[null,3,"x",10,"=",null,null,null,6,"x",7,"=",42]
[]
[]
[]
[null,{"$f":"IF(PRODUCT(F2:F14)*PRODUCT(M2:M14)='Quelle statisch'!E30,'Quelle statisch'!E31, 'Quelle statisch'!E32)","v":"Löse die Aufgaben! Die graue Maus wartet bereits auf Dich. Viel Glück und Erfolg beim Rechnen, Alva! "}]

{"sheet":"Quelle statisch","index":1,"n_rows":32,"n_cols":5,"rows_kept":32,"cut":false,"hidden":true,"merged":[]}
[]
[]
[6,"x",6,"=",{"$f":"A3*C3","v":36}]
[5,"x",6,"=",{"$f":"A4*C4","v":30}]
[8,"x",6,"=",48]
[1,"x",1,"=",1]
[8,"x",8,"=",64]
[4,"x",9,"=",36]
[10,"x",10,"=",100]
[2,"x",10,"=",20]
[1,"x",4,"=",4]
[6,"x",8,"=",48]
[7,"x",8,"=",56]
[1,"x",4,"=",4]
[5,"x",8,"=",40]
[5,"x",1,"=",5]
[8,"x",4,"=",32]
[2,"x",6,"=",12]
[6,"x",7,"=",42]
[6,"x",6,"=",36]
[4,"x",4,"=",16]
[2,"x",5,"=",10]
[4,"x",2,"=",8]
[6,"x",2,"=",12]
[7,"x",2,"=",14]
[5,"x",3,"=",15]
[6,"x",7,"=",42]
[3,"x",10,"=",30]
[]
[null,null,null,null,{"$f":"PRODUCT(E3:E28)","v":4.8486493455098669E+33}]
[null,null,null,null,"Herzlichen Glückwunsch!!!  Du findest die graue Maus in Deinem linken Stiefel neben der Kommode im Flur."]
[null,null,null,null,"Löse die Aufgaben! Die graue Maus wartet bereits auf Dich. Viel Glück und Erfolg beim Rechnen, Alva! "]

{"sheet":"Addition G100","index":2,"n_rows":26,"n_cols":26,"rows_kept":26,"cut":false,"hidden":false,"merged":[[0,1,0,5],[25,1,26,14],[1,1,5,14],[13,1,13,14],[14,1,14,14],[20,3,20,4],[21,3,21,4]]}
[null,"Addition ganze Zahlen -100 bis 100"]
[null,{"$f":"'Quelle dynamisch'!B12","v":"Löse die Aufgaben!  Viel Glück und Erfolg beim Rechnen! "}]
[]
[]
[]
[]
[]
[null,{"$f":"'Quelle dynamisch'!A3","v":-9},"+",{"$f":"'Quelle dynamisch'!C3","v":-20},"=",null,null,null,{"$f":"'Quelle dynamisch'!G3","v":19},"+",{"$f":"'Quelle dynamisch'!I3","v":13},"="]
[null,{"$f":"'Quelle dynamisch'!A4","v":19},"+",{"$f":"'Quelle dynamisch'!C4","v":-42},"=",null,null,null,{"$f":"'Quelle dynamisch'!G4","v":31},"+",{"$f":"'Quelle dynamisch'!I4","v":49},"="]
[null,{"$f":"'Quelle dynamisch'!A5","v":43},"+",{"$f":"'Quelle dynamisch'!C5","v":-40},"=",null,null,null,{"$f":"'Quelle dynamisch'!G5","v":49},"+",{"$f":"'Quelle dynamisch'!I5","v":17},"="]
[null,{"$f":"'Quelle dynamisch'!A6","v":-11},"+",{"$f":"'Quelle dynamisch'!C6","v":-22},"=",null,null,null,{"$f":"'Quelle dynamisch'!G6","v":-41},"+",{"$f":"'Quelle dynamisch'!I6","v":-5},"="]
[null,{"$f":"'Quelle dynamisch'!A7","v":-3},"+",{"$f":"'Quelle dynamisch'!C7","v":-47},"=",null,null,null,{"$f":"'Quelle dynamisch'!G7","v":-20},"+",{"$f":"'Quelle dynamisch'!I7","v":27},"="]
[]
[null,{"$f":"IF(B23=B24,\"Herzlichen Glückwunsch!\",\"Leider nicht alles richtig :-(.\")","v":"Leider nicht alles richtig :-(."}]
[null,{"$f":"IF(B23=B24,\"Du hast es wieder mal geschafft :-)!\",\"Du kannst noch besser werden :-)!\")","v":"Du kannst noch besser werden :-)!"}]
[]
[]
[]
[]
[]
[null,"00:06:42"]
[null,{"$f":"'Quelle dynamisch'!A15","v":"00:06:45"}]
[null,{"$f":"ABS(SUM(F8:F12))*ABS(SUM(M8:M12))","v":0}]
[null,{"$f":"ABS(SUM('Quelle dynamisch'!E3:E7))*ABS(SUM('Quelle dynamisch'!K3:K7))","v":18348}]
[null,{"$f":"ABS(B24-B23)","v":18348},null,null,null,null,null,null,null,null,null,null,null,null,null,null,null,null,null,null,null,null,null,null,null,0]
[null,"www.s-e-i.ch/Teaching/"]

{"sheet":"Division","index":3,"n_rows":27,"n_cols":16,"rows_kept":27,"cut":false,"hidden":true,"merged":[[1,1,5,14],[13,1,13,14],[14,1,14,14],[20,3,20,4],[21,3,21,4]]}
[]
[null,{"$f":"'Quelle dynamisch'!B12","v":"Löse die Aufgaben!  Viel Glück und Erfolg beim Rechnen! "}]
[]
[]
[]
[]
[]
[null,{"$f":"'Quelle dynamisch'!E3","v":-29},"÷",{"$f":"'Quelle dynamisch'!A3","v":-9},"=",null,null,null,{"$f":"'Quelle dynamisch'!K3","v":32},"÷",{"$f":"'Quelle dynamisch'!G3","v":19},"="]
[null,{"$f":"'Quelle dynamisch'!E4","v":-23},"÷",{"$f":"'Quelle dynamisch'!A4","v":19},"=",null,null,null,{"$f":"'Quelle dynamisch'!K4","v":80},"÷",{"$f":"'Quelle dynamisch'!G4","v":31},"="]
[null,{"$f":"'Quelle dynamisch'!E5","v":3},"÷",{"$f":"'Quelle dynamisch'!A5","v":43},"=",null,null,null,{"$f":"'Quelle dynamisch'!K5","v":66},"÷",{"$f":"'Quelle dynamisch'!G5","v":49},"="]
[null,{"$f":"'Quelle dynamisch'!E6","v":-33},"÷",{"$f":"'Quelle dynamisch'!A6","v":-11},"=",null,null,null,{"$f":"'Quelle dynamisch'!K6","v":-46},"÷",{"$f":"'Quelle dynamisch'!G6","v":-41},"="]
[null,{"$f":"'Quelle dynamisch'!E7","v":-50},"÷",{"$f":"'Quelle dynamisch'!A7","v":-3},"=",null,null,null,{"$f":"'Quelle dynamisch'!K7","v":7},"÷",{"$f":"'Quelle dynamisch'!G7","v":-20},"="]
[]
[null,{"$f":"IF(B23=B24,\"Herzlichen Glückwunsch!\",\"Leider nicht alles richtig :-(.\")","v":"Leider nicht alles richtig :-(."}]
[null,{"$f":"IF(B23=B24,\"Du hast es wieder mal geschafft :-)!\",\"Du kannst noch besser werden :-)!\")","v":"Du kannst noch besser werden :-)!"}]
[]
[]
[]
[]
[]
[null,"countdown",null,null,null,null,null,null,null,null,null,null,null,null,null,"00:00:29"]
[null,"time",null,null,null,null,null,null,null,null,null,null,null,null,null,"00:00:30"]
[null,{"$f":"PRODUCT(F8:F12)*PRODUCT(M8:M12)","v":0}]
[null,{"$f":"PRODUCT('Quelle dynamisch'!E3:E7)*PRODUCT('Quelle dynamisch'!K3:K7)","v":-179626664448000}]
[null,{"$f":"ABS(B24-B23)","v":179626664448000}]
[null,1]
[null,{"$f":"RANDBETWEEN(1,9)","v":6}]

{"sheet":"Quelle dynamisch","index":4,"n_rows":15,"n_cols":14,"rows_kept":15,"cut":false,"hidden":true,"merged":[]}
[]
[null,null,null,null,null,null,null,null,null,null,null,null,"Addition"]
[{"$f":"ROUND(RAND()*49+1,0)*(-1)^ROUND(RAND(),0)","v":-9},"+",{"$f":"ROUND(RAND()*49+1,0)*(-1)^ROUND(RAND(),0)","v":-20},"=",{"$f":"A3+C3","v":-29},null,{"$f":"ROUND(RAND()*49+1,0)*(-1)^ROUND(RAND(),0)","v":19},"+",{"$f":"ROUND(RAND()*49+1,0)*(-1)^ROUND(RAND(),0)","v":13},"=",{"$f":"G3+I3","v":32},null,{"$f":"E3-'Addition G100'!F8","v":-29},{"$f":"K3-'Addition G100'!M8","v":32}]
[{"$f":"ROUND(RAND()*49+1,0)*(-1)^ROUND(RAND(),0)","v":19},"+",-42,"=",{"$f":"A4+C4","v":-23},null,{"$f":"ROUND(RAND()*49+1,0)*(-1)^ROUND(RAND(),0)","v":31},"+",{"$f":"ROUND(RAND()*49+1,0)*(-1)^ROUND(RAND(),0)","v":49},"=",{"$f":"G4+I4","v":80},null,{"$f":"E4-'Addition G100'!F9","v":-23},{"$f":"K4-'Addition G100'!M9","v":80}]
[43,"+",-40,"=",3,null,49,"+",17,"=",66,null,{"$f":"E5-'Addition G100'!F10","v":3},{"$f":"K5-'Addition G100'!M10","v":66}]
[-11,"+",-22,"=",-33,null,-41,"+",-5,"=",-46,null,{"$f":"E6-'Addition G100'!F11","v":-33},{"$f":"K6-'Addition G100'!M11","v":-46}]
[-3,"+",-47,"=",-50,null,-20,"+",27,"=",7,null,{"$f":"E7-'Addition G100'!F12","v":-50},{"$f":"K7-'Addition G100'!M12","v":7}]
[]
[]
[]
[null,"Herzlichen Glückwunsch!"]
[null,"Löse die Aufgaben!  Viel Glück und Erfolg beim Rechnen! "]
[]
["Max zeit"]
["00:06:45"]